{"text_format":"1","workbook":"xlsx","n_sheets":6,"sheets":["Instructions","Race SPIN - NS ToT RC","Boats","Course","RSinput","ScoreSheet"],"not_rendered":{"charts":0,"images":2,"macros":1,"external_links":1,"defined_names":5,"comments":0,"pivot_tables":0},"unopened":[],"bounds":{"document_bytes":16777216,"sheet_cells":100000,"rows_first":2000,"rows_last":500,"rows_between":2000,"halvings":0,"cell_chars":16384,"cell_head_chars":4096},"cells_cut":0,"cells_raw":0,"read":"whole","date_system":"1900"}

{"sheet":"Instructions","index":0,"n_rows":34,"n_cols":5,"rows_kept":34,"cut":false,"hidden":false,"merged":[[17,0,17,14],[18,0,18,14],[19,0,19,14],[20,0,20,14],[21,0,21,14],[16,0,16,14],[0,0,0,14],[1,0,1,14],[2,0,2,14],[3,0,3,14],[4,0,4,14],[10,0,10,14],[11,0,11,14],[12,0,12,14],[13,0,13,14],[14,0,14,14],[15,0,15,14]]}
["Instructions:  Weekend Racing Worksheet"]
["ONLY Enter DATA In The SHADED Areas!!!!"]
["1. Select File - Save As, and Save with the \"File name\" as \"event<Date>\", eg \"SpringInvite19Apr20\"."]
["2. Select the Committee Boat Name (use pulldown) and Enter the Race Date."]
["3. Enter the Course (ENTER THE START MARK).  Use the Pulldown List.  The Course Length is automatically calculated."]
[null,"The Start location is assumed to be \"X\".  If the start location is moved then the distance must be manually calculated."]
[null,"If the course does not change for later starts, just leave the course selections blank for those starts.  "]
[null,"If later starts have a different course, enter the new course for each start that is different.  "]
["4. Select PHRF Course type:  W/L Or CR (Mostly Windward Leward -W/L or Circular Random (CR) for a mix that includes "]
[null,"windward, reaching, and leward).  Competitiors must be informed of selection prior to Warning!"]
["5. Enter each Yacht Name for the appropriate start.  Use the pulldown list.  The Sail Number and PHRF Rating is automatically   "]
["    completed.  If a Yacht Name is NOT in the pull down list, inquire about their race application and race fees. "]
["6. If the Start Time is different than the default, enter the New Start Time in 24-hour military format: (hr) (min) (sec)."]
["7. Save the File."]
["8. Enter the Finish Time for each boat in 24-hour military format: (hr) (min) (sec). "]
["     If a boat is DNS or DNF, leave the Finish Time as 23:00:00.  Enter the DNS or DNF in the Remarks column to the right of Corrected Time."]
["9. Save the File."]
["10. Select the Sort Fleet Button for each Class, located to the right of each Class's Remarks column."]
["11. Save the File."]
["12. Email the File to the Scorer at score@smsa.com"]
{"$rows_left_out":15}
{"sheet":"Race SPIN - NS ToT RC","index":1,"n_rows":53,"n_cols":20,"rows_kept":53,"cut":false,"hidden":false,"merged":[[31,2,31,3],[32,2,32,3],[32,4,32,5],[34,9,34,11],[34,14,34,18],[35,4,35,6],[35,9,35,11],[35,14,35,18],[9,9,9,11],[9,14,9,18],[10,4,10,6],[10,9,10,11],[10,14,10,18],[30,1,30,3],[2,3,2,7],[3,3,3,5],[4,3,4,19],[5,1,5,3],[6,2,6,3],[7,2,7,3],[7,4,7,5]]}
[]
["   Race Name :  --->"]
["  Committee Boat Name -->  "]
[null," Date  -->"]
[null," Conditions --> (optional)"]
[null,"NonSpin Class - Start =    ",null,null,13,5,0]
[null,null,"  Course   =      ",null,"Y",null,null,null,null,null,null,null,null,null,"<--  Default start location is 'X'."]
[null,null,"  Distance  =   ",null,{"$f":"IF(ISBLANK(F7), 0, VLOOKUP(E7,Course!$A$23:$T$41, LOOKUP(F7,Course!$A$2:$A$19,Course!$B$2:$B$19),FALSE))+IF(ISBLANK(G7), 0, VLOOKUP(F7,Course!$A$23:$T$41, LOOKUP(G7,Course!$A$2:$A$19,Course!$B$2:$B$19),FALSE))+IF(ISBLANK(J7), 0, VLOOKUP(G7,Course!$A$23:$T$41, LOOKUP(J7,Course!$A$2:$A$19,Course!$B$2:$B$19),FALSE))+IF(ISBLANK(K7), 0, VLOOKUP(J7,Course!$A$23:$T$41, LOOKUP(K7,Course!$A$2:$A$19,Course!$B$2:$B$19),FALSE))+IF(ISBLANK(L7), 0, VLOOKUP(K7,Course!$A$23:$T$41, LOOKUP(L7,Course!$A$2:$A$19,Course!$B$2:$B$19),FALSE))+IF(ISBLANK(M7), 0, VLOOKUP(L7,Course!$A$23:$T$41, LOOKUP(M7,Course!$A$2:$A$19,Course!$B$2:$B$19),FALSE))","v":0},null,null,null,null,null,null,null,null,null,"<--  Override Distance for W/L or Distance Race"]
[null,null,"PHRF Type =  ",null,"NSCR"]
[null,null,null,null,null,null,null,null,null,"Uncorrected",null,null,null,"PHRF","Corrected"]
[null,"Sail","Yacht","PHRF","Finish Time",null,null,null,null,"Elapsed Time",null,null,null,"Allowance","Time",null,null,null,null,"Remarks"]
[null,"Number","Name","Rating","(hr)","(min)","(sec)",null,null,"(hr)","(min)","(sec)",null,"(Sec)","(Total Sec)",null,"(hr)","(min)","(sec)","(DNS/DNF)"]
[null,{"$f":"LOOKUP(C13, Boats!$A$3:B$45,Boats!B$3:B$45)&NSFLAG","v":{"$error":"#N/A"}},null,{"$f":"IF(E$9=\"NSWL\",LOOKUP(C13, Boats!$A$3:E$45,Boats!I$3:I$45),(IF(E$9=\"NSCR\",LOOKUP(C13, Boats!$A$3:E$45,Boats!F$3:F$45),)))","v":{"$error":"#N/A"}},23,0,0,{"$f":"((E13*60*60+F13*60+G13)-(E$6*60*60+F$6*60+G$6))","v":35700},{"$f":"J13*60*60+K13*60","v":35700},{"$f":"ROUNDDOWN(H13/60/60, 0)","v":9},{"$f":"ROUNDDOWN((H13 - (J13*60*60))/60, 0)","v":55},{"$f":"H13-I13","v":0},null,{"$f":"650/(550+$D13)","v":{"$error":"#N/A"}},{"$f":"((J13*60+K13)*60+L13)*N13","v":{"$error":"#N/A"}},{"$f":"Q13*60*60+R13*60","v":{"$error":"#N/A"}},{"$f":"ROUNDDOWN(O13/60/60, 0)","v":{"$error":"#N/A"}},{"$f":"ROUNDDOWN((O13 - (Q13*60*60))/60, 0)","v":{"$error":"#N/A"}},{"$f":"O13-P13","v":{"$error":"#N/A"}}]
[1,{"$f":"LOOKUP(C14, Boats!$A$3:B$45,Boats!B$3:B$45)&NSFLAG","v":{"$error":"#N/A"}},null,{"$f":"IF(E$9=\"NSWL\",LOOKUP(C14, Boats!$A$3:E$45,Boats!H$3:H$45),(IF(E$9=\"NSCR\",LOOKUP(C14, Boats!$A$3:E$45,Boats!I$3:I$45),)))","v":{"$error":"#N/A"}},23,0,0,{"$f":"((E14*60*60+F14*60+G14)-(E$6*60*60+F$6*60+G$6))","v":35700},{"$f":"J14*60*60+K14*60","v":35700},{"$f":"ROUNDDOWN(H14/60/60, 0)","v":9},{"$f":"ROUNDDOWN((H14 - (J14*60*60))/60, 0)","v":55},{"$f":"H14-I14","v":0},null,{"$f":"650/(550+$D14)","v":{"$error":"#N/A"}},{"$f":"((J14*60+K14)*60+L14)*N14","v":{"$error":"#N/A"}},{"$f":"Q14*60*60+R14*60","v":{"$error":"#N/A"}},{"$f":"ROUNDDOWN(O14/60/60, 0)","v":{"$error":"#N/A"}},{"$f":"ROUNDDOWN((O14 - (Q14*60*60))/60, 0)","v":{"$error":"#N/A"}},{"$f":"O14-P14","v":{"$error":"#N/A"}}]
[3,{"$f":"LOOKUP(C15, Boats!$A$3:B$45,Boats!B$3:B$45)&NSFLAG","v":{"$error":"#N/A"}},null,{"$f":"IF(E$9=\"NSWL\",LOOKUP(C15, Boats!$A$3:E$45,Boats!I$3:I$45),(IF(E$9=\"NSCR\",LOOKUP(C15, Boats!$A$3:E$45,Boats!F$3:F$45),)))","v":{"$error":"#N/A"}},23,0,0,{"$f":"((E15*60*60+F15*60+G15)-(E$6*60*60+F$6*60+G$6))","v":35700},{"$f":"J15*60*60+K15*60","v":35700},{"$f":"ROUNDDOWN(H15/60/60, 0)","v":9},{"$f":"ROUNDDOWN((H15 - (J15*60*60))/60, 0)","v":55},{"$f":"H15-I15","v":0},null,{"$f":"650/(550+$D15)","v":{"$error":"#N/A"}},{"$f":"((J15*60+K15)*60+L15)*N15","v":{"$error":"#N/A"}},{"$f":"Q15*60*60+R15*60","v":{"$error":"#N/A"}},{"$f":"ROUNDDOWN(O15/60/60, 0)","v":{"$error":"#N/A"}},{"$f":"ROUNDDOWN((O15 - (Q15*60*60))/60, 0)","v":{"$error":"#N/A"}},{"$f":"O15-P15","v":{"$error":"#N/A"}}]
[4,{"$f":"LOOKUP(C16, Boats!$A$3:B$45,Boats!B$3:B$45)&NSFLAG","v":{"$error":"#N/A"}},null,{"$f":"IF(E$9=\"NSWL\",LOOKUP(C16, Boats!$A$3:E$45,Boats!I$3:I$45),(IF(E$9=\"NSCR\",LOOKUP(C16, Boats!$A$3:E$45,Boats!F$3:F$45),)))","v":{"$error":"#N/A"}},23,0,0,{"$f":"((E16*60*60+F16*60+G16)-(E$6*60*60+F$6*60+G$6))","v":35700},{"$f":"J16*60*60+K16*60","v":35700},{"$f":"ROUNDDOWN(H16/60/60, 0)","v":9},{"$f":"ROUNDDOWN((H16 - (J16*60*60))/60, 0)","v":55},{"$f":"H16-I16","v":0},null,{"$f":"650/(550+$D16)","v":{"$error":"#N/A"}},{"$f":"((J16*60+K16)*60+L16)*N16","v":{"$error":"#N/A"}},{"$f":"Q16*60*60+R16*60","v":{"$error":"#N/A"}},{"$f":"ROUNDDOWN(O16/60/60, 0)","v":{"$error":"#N/A"}},{"$f":"ROUNDDOWN((O16 - (Q16*60*60))/60, 0)","v":{"$error":"#N/A"}},{"$f":"O16-P16","v":{"$error":"#N/A"}}]
[5,{"$f":"LOOKUP(C17, Boats!$A$3:B$45,Boats!B$3:B$45)&NSFLAG","v":{"$error":"#N/A"}},null,{"$f":"IF(E$9=\"NSWL\",LOOKUP(C17, Boats!$A$3:E$45,Boats!I$3:I$45),(IF(E$9=\"NSCR\",LOOKUP(C17, Boats!$A$3:E$45,Boats!F$3:F$45),)))","v":{"$error":"#N/A"}},23,0,0,{"$f":"((E17*60*60+F17*60+G17)-(E$6*60*60+F$6*60+G$6))","v":35700},{"$f":"J17*60*60+K17*60","v":35700},{"$f":"ROUNDDOWN(H17/60/60, 0)","v":9},{"$f":"ROUNDDOWN((H17 - (J17*60*60))/60, 0)","v":55},{"$f":"H17-I17","v":0},null,{"$f":"650/(550+$D17)","v":{"$error":"#N/A"}},{"$f":"((J17*60+K17)*60+L17)*N17","v":{"$error":"#N/A"}},{"$f":"Q17*60*60+R17*60","v":{"$error":"#N/A"}},{"$f":"ROUNDDOWN(O17/60/60, 0)","v":{"$error":"#N/A"}},{"$f":"ROUNDDOWN((O17 - (Q17*60*60))/60, 0)","v":{"$error":"#N/A"}},{"$f":"O17-P17","v":{"$error":"#N/A"}}]
[6,{"$f":"LOOKUP(C18, Boats!$A$3:B$45,Boats!B$3:B$45)&NSFLAG","v":{"$error":"#N/A"}},null,{"$f":"IF(E$9=\"NSWL\",LOOKUP(C18, Boats!$A$3:E$45,Boats!I$3:I$45),(IF(E$9=\"NSCR\",LOOKUP(C18, Boats!$A$3:E$45,Boats!F$3:F$45),)))","v":{"$error":"#N/A"}},23,0,0,{"$f":"((E18*60*60+F18*60+G18)-(E$6*60*60+F$6*60+G$6))","v":35700},{"$f":"J18*60*60+K18*60","v":35700},{"$f":"ROUNDDOWN(H18/60/60, 0)","v":9},{"$f":"ROUNDDOWN((H18 - (J18*60*60))/60, 0)","v":55},{"$f":"H18-I18","v":0},null,{"$f":"650/(550+$D18)","v":{"$error":"#N/A"}},{"$f":"((J18*60+K18)*60+L18)*N18","v":{"$error":"#N/A"}},{"$f":"Q18*60*60+R18*60","v":{"$error":"#N/A"}},{"$f":"ROUNDDOWN(O18/60/60, 0)","v":{"$error":"#N/A"}},{"$f":"ROUNDDOWN((O18 - (Q18*60*60))/60, 0)","v":{"$error":"#N/A"}},{"$f":"O18-P18","v":{"$error":"#N/A"}}]
[7,{"$f":"LOOKUP(C19, Boats!$A$3:B$45,Boats!B$3:B$45)&NSFLAG","v":{"$error":"#N/A"}},null,{"$f":"IF(E$9=\"NSWL\",LOOKUP(C19, Boats!$A$3:E$45,Boats!I$3:I$45),(IF(E$9=\"NSCR\",LOOKUP(C19, Boats!$A$3:E$45,Boats!F$3:F$45),)))","v":{"$error":"#N/A"}},23,0,0,{"$f":"((E19*60*60+F19*60+G19)-(E$6*60*60+F$6*60+G$6))","v":35700},{"$f":"J19*60*60+K19*60","v":35700},{"$f":"ROUNDDOWN(H19/60/60, 0)","v":9},{"$f":"ROUNDDOWN((H19 - (J19*60*60))/60, 0)","v":55},{"$f":"H19-I19","v":0},null,{"$f":"650/(550+$D19)","v":{"$error":"#N/A"}},{"$f":"((J19*60+K19)*60+L19)*N19","v":{"$error":"#N/A"}},{"$f":"Q19*60*60+R19*60","v":{"$error":"#N/A"}},{"$f":"ROUNDDOWN(O19/60/60, 0)","v":{"$error":"#N/A"}},{"$f":"ROUNDDOWN((O19 - (Q19*60*60))/60, 0)","v":{"$error":"#N/A"}},{"$f":"O19-P19","v":{"$error":"#N/A"}}]
[8,{"$f":"LOOKUP(C20, Boats!$A$3:B$45,Boats!B$3:B$45)&NSFLAG","v":{"$error":"#N/A"}},null,{"$f":"IF(E$9=\"NSWL\",LOOKUP(C20, Boats!$A$3:E$45,Boats!I$3:I$45),(IF(E$9=\"NSCR\",LOOKUP(C20, Boats!$A$3:E$45,Boats!F$3:F$45),)))","v":{"$error":"#N/A"}},23,0,0,{"$f":"((E20*60*60+F20*60+G20)-(E$6*60*60+F$6*60+G$6))","v":35700},{"$f":"J20*60*60+K20*60","v":35700},{"$f":"ROUNDDOWN(H20/60/60, 0)","v":9},{"$f":"ROUNDDOWN((H20 - (J20*60*60))/60, 0)","v":55},{"$f":"H20-I20","v":0},null,{"$f":"650/(550+$D20)","v":{"$error":"#N/A"}},{"$f":"((J20*60+K20)*60+L20)*N20","v":{"$error":"#N/A"}},{"$f":"Q20*60*60+R20*60","v":{"$error":"#N/A"}},{"$f":"ROUNDDOWN(O20/60/60, 0)","v":{"$error":"#N/A"}},{"$f":"ROUNDDOWN((O20 - (Q20*60*60))/60, 0)","v":{"$error":"#N/A"}},{"$f":"O20-P20","v":{"$error":"#N/A"}}]
{"$rows_left_out":34}
{"sheet":"Boats","index":2,"n_rows":117,"n_cols":22,"rows_kept":117,"cut":false,"hidden":false,"merged":[[0,5,0,8]]}
[null,"N",null,null,null,"PHRF"]
["Boat","SailNo","Owner","Valid List 2022","email","Spin - WL","Spin - CR","NonSpin-WL","NonSpin-CR","Race Fee","Spinclass","I","J","P","E","LOA","LWL","Disp","UpSAD","DWSAD","DLWL"]
[null,null,null,null,null,null,null,null,null,null,null,null,null,null,null,null,null,null,null,null,null,{"$f":"SUM(V4:V52)","v":15}]
["American Flyer",39519,"Dan Schneider","Y","dc_schneider@msn.com",36,33,42,42,"yes","A",51.25,14.04,50.45,18.47,39.4,34.119999999999997,13000,29.96,63.34,146.10607247052599]
["Arctic Tern",93642,"PAX","Y",null,168,168,168,168,"no","C",null,null,null,null,null,null,null,null,null,null,1]
["Bad Cat","063","Jim Whited","Y","jimw625@comcast.net",36,30,42,42,"yes","A",48.36,13.84,45.17,45.17,36.5,32.700000000000003,9300,23.92,70.47,118.74,1]
["Badger",144,"Carl Feusaherns","N","feus@comcast.net",177,177,177,177,"yes","C",30.5,9.5,29.42,12.29,25.9,21.7,4250,19.829999999999998,41.94,185.68,1]
["Barba Roja",73052,"Steven Birchfield","Y",null,165,168,165,168,null,"C"]
["Barefoot","36-2 WK","Brent Griffith","Y",null,"N/A","N/A",141,144,null,"B"]
["Blue Boat Home",4856,"Lowell Martin","N",null,231,231,231,231,"no","C",34,11.25,28.67,10.5,26.8,21.8,6850,15.14,35.43,295.17,1]
["Blue Goose",93643,"PAX","N",null,168,168,168,168,"no","C"]
["C2 (squared)",720,"Chris  Staley",null,null,189,192,189,192,null,"C"]
["Cheetah",50473,"Marc Briere","Y","race@smsa.com",45,39,54,54,"yes","A",43.7,12.6,44.7,16.5,35.86,31.76,8150,25.41,73.319999999999993,113.14,1]
["CROCODILE","USA 61150 ","Scott Ward","Y",null,27,24,27,24,null,"A"]
["Dauntless",52353,"Jim Keen","Y",null,90,87,90,90,null,"A"]
["Elan",43162,"Gary Shaw","Y","garyshaw75@aol.com",159,162,159,162,"no","C",49.5,15.33,42,11,36.83,29.5,13500,18.71,39.33,234.75762231915499,1]
["Elysium",45,null,null,null,84,84,84,84]
["Flyer",25126,"Michael Major","N","mjamesmajor@gmail.com",111,111,114,114,"no","B",40.18,11.65,42.27,15.79,34.4,27.2,8825,21.24,39.65,195.78]
["Gemini",3700,"Joe Frost",null,null,132,129,132,132]
["J Ray","USA47","Larry Ray","Y","mlray@gmail.com",114,111,120,120,"yes","B",26.77,7.68,26.16,9.44,22.8,20.5,1750,29.6,43,90.68,1]
{"$rows_left_out":98}
{"sheet":"Course","index":3,"n_rows":50,"n_cols":20,"rows_kept":50,"cut":false,"hidden":false,"merged":[]}
[null,20,20,null,null,null,20,20,null,null,20,20]
[null,20,20,null,null,"A",2,2,null,"A",2,2,null,"Page has been customized for Wednesday night MARKS"]
["A",2,2,null,null,"B",3,3,null,"B",3,3]
["B",3,3,null,null,"C",4,4,null,"E",5,5]
["C",4,4,null,null,"E",5,5,null,"K",10,10]
["G",6,6,null,null,"G",6,6,null,"L",11,11]
["H",7,7,null,null,"H",7,7,null,"M",12,12]
["I",8,8,null,null,"I",8,8,null,"S",17,17]
["J",9,9,null,null,"J",9,9,null,"T",14,14]
["K",10,10,null,null,"K",10,10,null,"X",16,16]
["L",11,11,null,null,"L",11,11,null,"Y",18,18]
["M",12,12,null,null,"M",12,12,null,"Z",19,19]
["S",17,17,null,null,"S",17,17]
["T",14,14,null,null,"T",14,14]
["V",16,16,null,null,"V",16,16]
["X",16,16,null,null,"X",16,16]
["Y",18,18,null,null,"Y",18,18]
["Z",19,19,null,null,"Z",19,19]
[null,"Active",null,null,null,null,"All",null,null,null,"Bay"]
[]
{"$rows_left_out":31}
{"sheet":"RSinput","index":4,"n_rows":20,"n_cols":8,"rows_kept":20,"cut":false,"hidden":false,"merged":[]}
["Sail","BoatName","PHRF",null,null,null,"Finish","Division"]
[null,null,null,null,null,null,{"$f":"TIME(D2,E2,F2)","v":"00:00:00"},"PHRF A"]
[null,null,null,null,null,null,"00:00:00","PHRF B"]
[null,null,null,null,null,null,"00:00:00","PHRF A"]
[null,null,null,null,null,null,"00:00:00","PHRF C"]
[null,null,null,null,null,null,"00:00:00","PHRF A"]
[null,null,null,null,null,null,"00:00:00","PHRF C"]
[null,null,null,null,null,null,"00:00:00","PHRF B"]
[null,null,null,null,null,null,"00:00:00","PHRF A"]
[null,null,null,null,null,null,"00:00:00","PHRF A"]
[null,null,null,null,null,null,"00:00:00","PHRF B"]
[null,null,null,null,null,null,"00:00:00","PHRF A"]
[null,null,null,null,null,null,"00:00:00","PHRF C"]
[null,null,null,null,null,null,"00:00:00","PHRF B"]
[null,null,null,null,null,null,"00:00:00","PHRF B"]
[null,null,null,null,null,null,"00:00:00","PHRF B"]
[null,null,null,null,null,null,"00:00:00","PHRF A"]
[null,null,null,null,null,null,"00:00:00","NonSpin"]
[null,null,null,null,null,null,"00:00:00","NonSpin"]
[null,null,null,null,null,null,"00:00:00","NonSpin"]
{"$rows_left_out":1}
{"sheet":"ScoreSheet","index":5,"n_rows":53,"n_cols":15,"rows_kept":53,"cut":false,"hidden":false,"merged":[[0,0,0,3],[2,2,2,4],[0,4,0,10],[2,13,2,14]]}
["SMSA Scoring Worksheet",null,null,null,"Race Name _________________________________"]
[null,"Date : ","_____________________",null,null,"RC: ",null,"____________________"]
[null,"Course: ","_______________________________________",null,null,null,null,null,null,null,null,"Finish time",null,"Order of Finish"]
["Boat","SailNo","Owner","Spin - WL","Spin - CR","NonSpin-WL","NonSpin-CR","Spinclass","Checked In",null,"(hr)","(min)","(sec)","Boat","Running Finish Time"]
[" "," "," "," "," "," ",null," "]
[{"$f":"[1]Boats!A4","v":"American Flyer"},{"$f":"[1]Boats!B4","v":39519},{"$f":"[1]Boats!C4","v":"Dan Schneider"},{"$f":"[1]Boats!F4","v":36},{"$f":"[1]Boats!G4","v":33},{"$f":"[1]Boats!H4","v":42},{"$f":"[1]Boats!I4","v":42},{"$f":"[1]Boats!K4","v":"A"}]
[{"$f":"[1]Boats!A5","v":"Arctic Tern"},{"$f":"[1]Boats!B5","v":93642},{"$f":"[1]Boats!C5","v":"PAX"},{"$f":"[1]Boats!F5","v":168},{"$f":"[1]Boats!G5","v":168},{"$f":"[1]Boats!H5","v":168},{"$f":"[1]Boats!I5","v":168},{"$f":"[1]Boats!K5","v":"C"}]
[{"$f":"[1]Boats!A6","v":"Bad Cat"},{"$f":"[1]Boats!B6","v":"063"},{"$f":"[1]Boats!C6","v":"Jim Whited"},{"$f":"[1]Boats!F6","v":36},{"$f":"[1]Boats!G6","v":30},{"$f":"[1]Boats!H6","v":42},{"$f":"[1]Boats!I6","v":42},{"$f":"[1]Boats!K6","v":"A"}]
[{"$f":"[1]Boats!A7","v":"Badger"},{"$f":"[1]Boats!B7","v":144},{"$f":"[1]Boats!C7","v":"Carl Feusaherns"},{"$f":"[1]Boats!F7","v":177},{"$f":"[1]Boats!G7","v":177},{"$f":"[1]Boats!H7","v":177},{"$f":"[1]Boats!I7","v":177},{"$f":"[1]Boats!K7","v":"C"}]
[{"$f":"[1]Boats!A8","v":"Barba Roja"},{"$f":"[1]Boats!B8","v":73052},{"$f":"[1]Boats!C8","v":"Steven Birchfield"},{"$f":"[1]Boats!F8","v":165},{"$f":"[1]Boats!G8","v":168},{"$f":"[1]Boats!H8","v":165},{"$f":"[1]Boats!I8","v":168},{"$f":"[1]Boats!K8","v":"C"}]
[{"$f":"[1]Boats!A9","v":"Barefoot"},{"$f":"[1]Boats!B9","v":"36-2 WK"},{"$f":"[1]Boats!C9","v":"Brent Griffith"},{"$f":"[1]Boats!F9","v":"N/A"},{"$f":"[1]Boats!G9","v":"N/A"},{"$f":"[1]Boats!H9","v":141},{"$f":"[1]Boats!I9","v":144},{"$f":"[1]Boats!K9","v":"B"}]
[{"$f":"[1]Boats!A10","v":"Blue Boat Home"},{"$f":"[1]Boats!B10","v":4856},{"$f":"[1]Boats!C10","v":"Lowell Martin"},{"$f":"[1]Boats!F10","v":231},{"$f":"[1]Boats!G10","v":231},{"$f":"[1]Boats!H10","v":231},{"$f":"[1]Boats!I10","v":231},{"$f":"[1]Boats!K10","v":"C"}]
[{"$f":"[1]Boats!A11","v":"Blue Goose"},{"$f":"[1]Boats!B11","v":93643},{"$f":"[1]Boats!C11","v":"PAX"},{"$f":"[1]Boats!F11","v":168},{"$f":"[1]Boats!G11","v":168},{"$f":"[1]Boats!H11","v":168},{"$f":"[1]Boats!I11","v":168},{"$f":"[1]Boats!K11","v":"C"}]
[{"$f":"[1]Boats!A12","v":"C2 (squared)"},{"$f":"[1]Boats!B12","v":720},{"$f":"[1]Boats!C12","v":"Chris  Staley"},{"$f":"[1]Boats!F12","v":189},{"$f":"[1]Boats!G12","v":192},{"$f":"[1]Boats!H12","v":189},{"$f":"[1]Boats!I12","v":192},{"$f":"[1]Boats!K12","v":"C"}]
[{"$f":"[1]Boats!A13","v":"Cheetah"},{"$f":"[1]Boats!B13","v":50473},{"$f":"[1]Boats!C13","v":"Marc Briere"},{"$f":"[1]Boats!F13","v":45},{"$f":"[1]Boats!G13","v":39},{"$f":"[1]Boats!H13","v":54},{"$f":"[1]Boats!I13","v":54},{"$f":"[1]Boats!K13","v":"A"}]
[{"$f":"[1]Boats!A14","v":"CROCODILE"},{"$f":"[1]Boats!B14","v":"USA 61150 "},{"$f":"[1]Boats!C14","v":"Scott Ward"},{"$f":"[1]Boats!F14","v":27},{"$f":"[1]Boats!G14","v":24},{"$f":"[1]Boats!H14","v":27},{"$f":"[1]Boats!I14","v":24},{"$f":"[1]Boats!K14","v":"A"}]
[{"$f":"[1]Boats!A15","v":"Dauntless"},{"$f":"[1]Boats!B15","v":52353},{"$f":"[1]Boats!C15","v":"Jim Keen"},{"$f":"[1]Boats!F15","v":90},{"$f":"[1]Boats!G15","v":87},{"$f":"[1]Boats!H15","v":90},{"$f":"[1]Boats!I15","v":90},{"$f":"[1]Boats!K15","v":"A"}]
[{"$f":"[1]Boats!A16","v":"Elan"},{"$f":"[1]Boats!B16","v":43162},{"$f":"[1]Boats!C16","v":"Gary Shaw"},{"$f":"[1]Boats!F16","v":159},{"$f":"[1]Boats!G16","v":162},{"$f":"[1]Boats!H16","v":159},{"$f":"[1]Boats!I16","v":162},{"$f":"[1]Boats!K16","v":"C"}]
[{"$f":"[1]Boats!A18","v":"Flyer"},{"$f":"[1]Boats!B18","v":25126},{"$f":"[1]Boats!C18","v":"Michael Major"},{"$f":"[1]Boats!F18","v":111},{"$f":"[1]Boats!G18","v":111},{"$f":"[1]Boats!H18","v":114},{"$f":"[1]Boats!I18","v":114},{"$f":"[1]Boats!K18","v":"B"}]
[{"$f":"[1]Boats!A19","v":"Gemini"},{"$f":"[1]Boats!B19","v":3700},{"$f":"[1]Boats!C19","v":"Joe Frost"},{"$f":"[1]Boats!F19","v":132},{"$f":"[1]Boats!G19","v":129},{"$f":"[1]Boats!H19","v":132},{"$f":"[1]Boats!I19","v":132},{"$f":"[1]Boats!K19","v":0}]
{"$rows_left_out":33}